Target
Perilipin-1
Ligand
BDBM94545
Substrate
IC50
1592±n/a nM
Citation
 PubChem, PC Counterscreen for inhibitors of the interaction of the lipase co-activator protein, abhydrolase domain containing 5 (ABHD5) with perilipin-5 (MLDP; PLIN5) PubChem Bioassay (2012)[AID] 
Target
Name:
Perilipin-1
Synonyms:
PERI PLIN1 | PLIN1_HUMAN
Type:
Enzyme Catalytic Domain
Mol. Mass.:
55988.69
Organism:
Homo sapiens (Human)
Description:
gi_223718203
Residue:
522
  
Inhibitor
Name:
BDBM94545
Synonyms:
2-[3-(2-furanyl)-2-oxo-1-quinoxalinyl]-N-(phenylmethyl)-2-[4-(trifluoromethyl)phenyl]acetamide MLS003674182 N-benzyl-2-[3-(furan-2-yl)-2-oxoquinoxalin-1-yl]-2-[4-(trifluoromethyl)phenyl]acetamide cid_53383163
Type:
Small organic molecule
Emp. Form.:
C28H20F3N3O3
Mol. Mass.:
503.4719
SMILES:
FC(F)(F)c1ccc(cc1)C(C(=O)NCc1ccccc1)n1c2ccccc2nc(-c2ccco2)c1=O
: