Target
Perilipin-1
Ligand
BDBM94606
Substrate
IC50
14700±n/a nM
Citation
 PubChem, PC Counterscreen for inhibitors of the interaction of the lipase co-activator protein, abhydrolase domain containing 5 (ABHD5) with perilipin-5 (MLDP; PLIN5) PubChem Bioassay (2012)[AID] 
Target
Name:
Perilipin-1
Synonyms:
PERI PLIN1 | PLIN1_HUMAN
Type:
Enzyme Catalytic Domain
Mol. Mass.:
55988.69
Organism:
Homo sapiens (Human)
Description:
gi_223718203
Residue:
522
  
Inhibitor
Name:
BDBM94606
Synonyms:
(2R)-2-[2-[(1R)-1-(4-chlorophenyl)-1-phenyl-ethoxy]ethyl]-1-methyl-pyrrolidine;fumarate (E)-but-2-enedioate;(2R)-2-[2-[(1R)-1-(4-chlorophenyl)-1-phenyl-ethoxy]ethyl]-1-methyl-pyrrolidine Clemastine fumarate SMR001233520 | cid_45479735
Type:
Small organic molecule
Emp. Form.:
C21H26ClNO
Mol. Mass.:
343.89
SMILES:
CN1CCC[C@@H]1CCO[C@](C)(c1ccccc1)c1ccc(Cl)cc1
: