Target
Perilipin-1
Ligand
BDBM94615
Substrate
IC50
1916±n/a nM
Citation
 PubChem, PC Counterscreen for inhibitors of the interaction of the lipase co-activator protein, abhydrolase domain containing 5 (ABHD5) with perilipin-5 (MLDP; PLIN5) PubChem Bioassay (2012)[AID] 
Target
Name:
Perilipin-1
Synonyms:
PERI PLIN1 | PLIN1_HUMAN
Type:
Enzyme Catalytic Domain
Mol. Mass.:
55988.69
Organism:
Homo sapiens (Human)
Description:
gi_223718203
Residue:
522
  
Inhibitor
Name:
BDBM94615
Synonyms:
2-(4-cyanophenyl)-N-cyclohexyl-2-[3-(2-furanyl)-2-oxo-1-quinoxalinyl]acetamide 2-(4-cyanophenyl)-N-cyclohexyl-2-[3-(furan-2-yl)-2-oxidanylidene-quinoxalin-1-yl]ethanamide MLS003674211 cid_53383336
Type:
Small organic molecule
Emp. Form.:
C27H24N4O3
Mol. Mass.:
452.5045
SMILES:
O=C(NC1CCCCC1)C(c1ccc(cc1)C#N)n1c2ccccc2nc(-c2ccco2)c1=O
: