Target
Perilipin-5
Ligand
BDBM64280
Substrate
IC50
1938±n/a nM
Citation
 PubChem, PC Luminescence-based biochemical high throughput dose response assay for inhibitors of the interaction of the lipase co-activator protein, abhydrolase domain containing 5 (ABHD5) with perilipin-5 (MLDP; PLIN5) PubChem Bioassay (2012)[AID] 
Target
Name:
Perilipin-5
Synonyms:
LSDP5 PAT-1 PLIN5_HUMAN
Type:
Enzyme Catalytic Domain
Mol. Mass.:
50774.20
Organism:
Homo sapiens (Human)
Description:
gi_116292172
Residue:
463
  
Inhibitor
Name:
BDBM64280
Synonyms:
5-chloranyl-2-[(4-fluorophenyl)methylsulfonyl]-N-(5-propan-2-yl-1,3,4-thiadiazol-2-yl)pyrimidine-4-carboxamide 5-chloro-2-[(4-fluorophenyl)methylsulfonyl]-N-(5-propan-2-yl-1,3,4-thiadiazol-2-yl)-4-pyrimidinecarboxamide MLS001116206 cid_16446399
Type:
Small organic molecule
Emp. Form.:
C17H15ClFN5O3S2
Mol. Mass.:
455.914
SMILES:
CC(C)c1nnc(NC(=O)c2nc(ncc2Cl)S(=O)(=O)Cc2ccc(F)cc2)s1
: