Target
Perilipin-5
Ligand
BDBM83788
Substrate
IC50
1317±n/a nM
Citation
 PubChem, PC Luminescence-based biochemical high throughput dose response assay for inhibitors of the interaction of the lipase co-activator protein, abhydrolase domain containing 5 (ABHD5) with perilipin-5 (MLDP; PLIN5) PubChem Bioassay (2012)[AID] 
Target
Name:
Perilipin-5
Synonyms:
LSDP5 PAT-1 PLIN5_HUMAN
Type:
Enzyme Catalytic Domain
Mol. Mass.:
50774.20
Organism:
Homo sapiens (Human)
Description:
gi_116292172
Residue:
463
  
Inhibitor
Name:
BDBM83788
Synonyms:
(5Z)-1-benzyl-5-[(E)-3-(2-furyl)prop-2-enylidene]barbituric acid (5Z)-5-[(E)-3-(2-furanyl)prop-2-enylidene]-1-(phenylmethyl)-1,3-diazinane-2,4,6-trione 1-benzyl-5-[3-(2-furyl)-2-propen-1-ylidene]-2,4,6(1H,3H,5H)-pyrimidinetrione SMR000268660 | cid_1908237
Type:
Small organic molecule
Emp. Form.:
C18H14N2O4
Mol. Mass.:
322.3148
SMILES:
O=C1NC(=O)\C(=C\C=C\c2ccco2)C(=O)N1Cc1ccccc1
: