Target
Perilipin-5
Ligand
BDBM47853
Substrate
IC50
922±n/a nM
Citation
 PubChem, PC Luminescence-based biochemical high throughput dose response assay for inhibitors of the interaction of the lipase co-activator protein, abhydrolase domain containing 5 (ABHD5) with perilipin-5 (MLDP; PLIN5) PubChem Bioassay (2012)[AID] 
Target
Name:
Perilipin-5
Synonyms:
LSDP5 PAT-1 PLIN5_HUMAN
Type:
Enzyme Catalytic Domain
Mol. Mass.:
50774.20
Organism:
Homo sapiens (Human)
Description:
gi_116292172
Residue:
463
  
Inhibitor
Name:
BDBM47853
Synonyms:
2-furancarboxylic acid [4-bromo-2-[(E)-3-(4-methylphenyl)-1-oxoprop-2-enyl]phenyl] ester MLS000575689 [4-bromanyl-2-[(E)-3-(4-methylphenyl)prop-2-enoyl]phenyl] furan-2-carboxylate cid_5735038 | furan-2-carboxylic acid [4-bromo-2-[(E)-3-(p-tolyl)acryloyl]phenyl] ester
Type:
Small organic molecule
Emp. Form.:
C21H15BrO4
Mol. Mass.:
411.245
SMILES:
Cc1ccc(\C=C\C(=O)c2cc(Br)ccc2OC(=O)c2ccco2)cc1
: