Target
Xylosyl- and glucuronyltransferase LARGE1
Ligand
BDBM94714
Substrate
EC50
6370±n/a nM
Citation
 PubChem, PC Dose response confirmation of small molecule activators of alpha dystroglycan glycosylation PubChem Bioassay (2012)[AID] 
Target
Name:
Xylosyl- and glucuronyltransferase LARGE1
Synonyms:
KIAA0609 LARGE | LARGE1
Type:
Enzyme Catalytic Domain
Mol. Mass.:
88079.63
Organism:
Homo sapiens (Human)
Description:
gi_47678551
Residue:
756
  
Inhibitor
Name:
BDBM94714
Synonyms:
1-[2-[(4-isobutoxybenzyl)thio]ethyl]-3-phenyl-thiourea 1-[2-[[4-(2-methylpropoxy)phenyl]methylsulfanyl]ethyl]-3-phenylthiourea MLS000574381 SMR000195044 | cid_2282785
Type:
Small organic molecule
Emp. Form.:
C20H26N2OS2
Mol. Mass.:
374.563
SMILES:
CC(C)COc1ccc(CSCCNC(=S)Nc2ccccc2)cc1
: