Target
Xylosyl- and glucuronyltransferase LARGE1
Ligand
BDBM94724
Substrate
EC50
18000±n/a nM
Citation
 PubChem, PC Dose response confirmation of small molecule activators of alpha dystroglycan glycosylation PubChem Bioassay (2012)[AID] 
Target
Name:
Xylosyl- and glucuronyltransferase LARGE1
Synonyms:
KIAA0609 LARGE | LARGE1
Type:
Enzyme Catalytic Domain
Mol. Mass.:
88079.63
Organism:
Homo sapiens (Human)
Description:
gi_47678551
Residue:
756
  
Inhibitor
Name:
BDBM94724
Synonyms:
2-[[4-(2-chloro-6-fluoro-benzyl)oxy-3-methoxy-benzyl]amino]ethyl-dimethyl-amine;hydrochloride N'-{4-[(2-chloro-6-fluorobenzyl)oxy]-3-methoxybenzyl}-N,N-dimethyl-1,2-ethanediamine dihydrochloride N-[[4-[(2-chloro-6-fluorophenyl)methoxy]-3-methoxyphenyl]methyl]-N',N'-dimethylethane-1,2-diamine;hydrochloride cid_16189714
Type:
Small organic molecule
Emp. Form.:
C19H24ClFN2O2
Mol. Mass.:
366.857
SMILES:
COc1cc(CNCCN(C)C)ccc1OCc1c(F)cccc1Cl
: