Target
Xylosyl- and glucuronyltransferase LARGE1
Ligand
BDBM94725
Substrate
EC50
>80000±n/a nM
Citation
 PubChem, PC Dose response confirmation of small molecule activators of alpha dystroglycan glycosylation PubChem Bioassay (2012)[AID] 
Target
Name:
Xylosyl- and glucuronyltransferase LARGE1
Synonyms:
KIAA0609 LARGE | LARGE1
Type:
Enzyme Catalytic Domain
Mol. Mass.:
88079.63
Organism:
Homo sapiens (Human)
Description:
gi_47678551
Residue:
756
  
Inhibitor
Name:
BDBM94725
Synonyms:
1-(4-ethylphenyl)-2-[(4-ethylpiperazin-1-yl)acetyl]-2,3,4,9-tetrahydro-1H-beta-carboline 1-[1-(4-ethylphenyl)-1,3,4,9-tetrahydropyrido[3,4-b]indol-2-yl]-2-(4-ethyl-1-piperazinyl)ethanone MLS000734223 cid_16190460
Type:
Small organic molecule
Emp. Form.:
C27H34N4O
Mol. Mass.:
430.5851
SMILES:
CCN1CCN(CC(=O)N2CCc3c([nH]c4ccccc34)C2c2ccc(CC)cc2)CC1
: