Target
Xylosyl- and glucuronyltransferase LARGE1
Ligand
BDBM94727
Substrate
EC50
12700±n/a nM
Citation
 PubChem, PC Dose response confirmation of small molecule activators of alpha dystroglycan glycosylation PubChem Bioassay (2012)[AID] 
Target
Name:
Xylosyl- and glucuronyltransferase LARGE1
Synonyms:
KIAA0609 LARGE | LARGE1
Type:
Enzyme Catalytic Domain
Mol. Mass.:
88079.63
Organism:
Homo sapiens (Human)
Description:
gi_47678551
Residue:
756
  
Inhibitor
Name:
BDBM94727
Synonyms:
2-hydroxy-N-[(Z)-1-(5-nitro-2-furanyl)ethylideneamino]-2,2-diphenylacetamide 2-hydroxy-N-[(Z)-1-(5-nitrofuran-2-yl)ethylideneamino]-2,2-diphenylacetamide N-[(Z)-1-(5-nitrofuran-2-yl)ethylideneamino]-2-oxidanyl-2,2-diphenyl-ethanamide cid_5440766
Type:
Small organic molecule
Emp. Form.:
C20H17N3O5
Mol. Mass.:
379.3661
SMILES:
CC(=NNC(=O)C(O)(c1ccccc1)c1ccccc1)c1ccc(o1)[N+]([O-])=O
: