Target
Xylosyl- and glucuronyltransferase LARGE1
Ligand
BDBM72784
Substrate
EC50
3170±n/a nM
Citation
 PubChem, PC Dose response confirmation of small molecule activators of alpha dystroglycan glycosylation PubChem Bioassay (2012)[AID] 
Target
Name:
Xylosyl- and glucuronyltransferase LARGE1
Synonyms:
KIAA0609 LARGE | LARGE1
Type:
Enzyme Catalytic Domain
Mol. Mass.:
88079.63
Organism:
Homo sapiens (Human)
Description:
gi_47678551
Residue:
756
  
Inhibitor
Name:
BDBM72784
Synonyms:
4-[acetyl(phenylsulfonyl)amino]-2-chloro-1-naphthyl acetate SMR000473070 [4-[acetyl(benzenesulfonyl)amino]-2-chloronaphthalen-1-yl] acetate acetic acid [4-[acetyl(besyl)amino]-2-chloro-1-naphthyl] ester | cid_1381611
Type:
Small organic molecule
Emp. Form.:
C20H16ClNO5S
Mol. Mass.:
417.863
SMILES:
CC(=O)Oc1c(Cl)cc(N(C(C)=O)S(=O)(=O)c2ccccc2)c2ccccc12
: