Target
Sentrin-specific protease 1
Ligand
BDBM60464
Substrate
IC50
15000±n/a nM
Citation
 PubChem, PC Dose response confirmation of small molecule inhibitors of the catalytic domain of the SUMO protease, SENP1 in a FRET assay PubChem Bioassay (2012)[AID] 
Target
Name:
Sentrin-specific protease 1
Synonyms:
SENP1 Sentrin-specific protease 1 (SENP1)
Type:
Protein
Mol. Mass.:
73500.42
Organism:
Homo sapiens (Human)
Description:
Q9P0U3
Residue:
644
  
Inhibitor
Name:
BDBM60464
Synonyms:
4-({[1-(2,4-dimethylphenyl)-3-methyl-5-oxo-1,5-dihydro-4H-pyrazol-4-ylidene]methyl}amino)-3-methoxybenzenesulfenyl cyanide SMR000161968 [4-[[(Z)-[1-(2,4-dimethylphenyl)-3-methyl-5-oxopyrazol-4-ylidene]methyl]amino]-3-methoxyphenyl] thiocyanate thiocyanic acid [4-[[(Z)-[1-(2,4-dimethylphenyl)-3-methyl-5-oxo-4-pyrazolylidene]methyl]amino]-3-methoxyphenyl] ester | thiocyanic acid [4-[[(Z)-[1-(2,4-dimethylphenyl)-5-keto-3-methyl-2-pyrazolin-4-ylidene]methyl]amino]-3-methoxy-phenyl] ester
Type:
Small organic molecule
Emp. Form.:
C21H20N4O2S
Mol. Mass.:
392.474
SMILES:
COc1cc(SC#N)ccc1N=Cc1c(C)[nH]n(-c2ccc(C)cc2C)c1=O
: