Target
Sentrin-specific protease 1
Ligand
BDBM83554
Substrate
IC50
14000±n/a nM
Citation
 PubChem, PC Dose response confirmation of small molecule inhibitors of the catalytic domain of the SUMO protease, SENP1 in a FRET assay PubChem Bioassay (2012)[AID] 
Target
Name:
Sentrin-specific protease 1
Synonyms:
SENP1 Sentrin-specific protease 1 (SENP1)
Type:
Protein
Mol. Mass.:
73500.42
Organism:
Homo sapiens (Human)
Description:
Q9P0U3
Residue:
644
  
Inhibitor
Name:
BDBM83554
Synonyms:
MLS000583889 N-(3,5-difluorophenyl)-3-nitro-4-(phenethylamino)benzamide N-[3,5-bis(fluoranyl)phenyl]-3-nitro-4-(2-phenylethylamino)benzamide cid_12004901
Type:
Small organic molecule
Emp. Form.:
C21H17F2N3O3
Mol. Mass.:
397.3748
SMILES:
[O-][N+](=O)c1cc(ccc1NCCc1ccccc1)C(=O)Nc1cc(F)cc(F)c1
: