Target
Sentrin-specific protease 1
Ligand
BDBM94791
Substrate
IC50
11100±n/a nM
Citation
 PubChem, PC Dose response confirmation of small molecule inhibitors of the catalytic domain of the SUMO protease, SENP1 in a FRET assay PubChem Bioassay (2012)[AID] 
Target
Name:
Sentrin-specific protease 1
Synonyms:
SENP1 Sentrin-specific protease 1 (SENP1)
Type:
Protein
Mol. Mass.:
73500.42
Organism:
Homo sapiens (Human)
Description:
Q9P0U3
Residue:
644
  
Inhibitor
Name:
BDBM94791
Synonyms:
1-[(E)-(5-morpholin-4-ylthiophen-2-yl)methylideneamino]urea SMR000259256 [(E)-(5-morpholino-2-thienyl)methyleneamino]urea cid_6904031
Type:
Small organic molecule
Emp. Form.:
C10H14N4O2S
Mol. Mass.:
254.309
SMILES:
NC(=O)NN=Cc1ccc(s1)N1CCOCC1
: