Target
Sentrin-specific protease 1
Ligand
BDBM78236
Substrate
IC50
17200±n/a nM
Citation
 PubChem, PC Dose response confirmation of small molecule inhibitors of the catalytic domain of the SUMO protease, SENP1 in a FRET assay PubChem Bioassay (2012)[AID] 
Target
Name:
Sentrin-specific protease 1
Synonyms:
SENP1 Sentrin-specific protease 1 (SENP1)
Type:
Protein
Mol. Mass.:
73500.42
Organism:
Homo sapiens (Human)
Description:
Q9P0U3
Residue:
644
  
Inhibitor
Name:
BDBM78236
Synonyms:
1-(2,4-dimethylphenyl)-4-(4-nitrophenyl)-4-imidazoline-2-thione MLS000390695 cid_2368426
Type:
Small organic molecule
Emp. Form.:
C17H15N3O2S
Mol. Mass.:
325.385
SMILES:
Cc1ccc(c(C)c1)-n1cc([nH]c1=S)-c1ccc(cc1)[N+]([O-])=O
: