Target
Sentrin-specific protease 1
Ligand
BDBM94794
Substrate
IC50
25800±n/a nM
Citation
 PubChem, PC Dose response confirmation of small molecule inhibitors of the catalytic domain of the SUMO protease, SENP1 in a FRET assay PubChem Bioassay (2012)[AID] 
Target
Name:
Sentrin-specific protease 1
Synonyms:
SENP1 Sentrin-specific protease 1 (SENP1)
Type:
Protein
Mol. Mass.:
73500.42
Organism:
Homo sapiens (Human)
Description:
Q9P0U3
Residue:
644
  
Inhibitor
Name:
BDBM94794
Synonyms:
(E)-2-cyano-3-(2-piperidin-1-ylquinolin-3-yl)prop-2-enamide (E)-2-cyano-3-[2-(1-piperidinyl)-3-quinolinyl]-2-propenamide SMR000255753 | cid_1515820
Type:
Small organic molecule
Emp. Form.:
C18H18N4O
Mol. Mass.:
306.3617
SMILES:
NC(=O)C(=C\c1cc2ccccc2nc1N1CCCCC1)\C#N
: