Target
Sentrin-specific protease 1
Ligand
BDBM94797
Substrate
IC50
19900±n/a nM
Citation
 PubChem, PC Dose response confirmation of small molecule inhibitors of the catalytic domain of the SUMO protease, SENP1 in a FRET assay PubChem Bioassay (2012)[AID] 
Target
Name:
Sentrin-specific protease 1
Synonyms:
SENP1 Sentrin-specific protease 1 (SENP1)
Type:
Protein
Mol. Mass.:
73500.42
Organism:
Homo sapiens (Human)
Description:
Q9P0U3
Residue:
644
  
Inhibitor
Name:
BDBM94797
Synonyms:
MLS000394458 N-(3,4,5-trimethoxyphenyl)benzo[cd]indol-2-amine benzo[cd]indol-2-yl-(3,4,5-trimethoxyphenyl)amine | cid_2323108
Type:
Small organic molecule
Emp. Form.:
C20H18N2O3
Mol. Mass.:
334.3685
SMILES:
COc1cc(NC2=Nc3cccc4cccc2c34)cc(OC)c1OC
: