Target
Sentrin-specific protease 1
Ligand
BDBM94799
Substrate
IC50
12700±n/a nM
Citation
 PubChem, PC Dose response confirmation of small molecule inhibitors of the catalytic domain of the SUMO protease, SENP1 in a FRET assay PubChem Bioassay (2012)[AID] 
Target
Name:
Sentrin-specific protease 1
Synonyms:
SENP1 Sentrin-specific protease 1 (SENP1)
Type:
Protein
Mol. Mass.:
73500.42
Organism:
Homo sapiens (Human)
Description:
Q9P0U3
Residue:
644
  
Inhibitor
Name:
BDBM94799
Synonyms:
3-benzyl-4-keto-7-methyl-1-phenyl-pyrimido[1,2-b]pyridazin-5-ium-2-olate 3-benzyl-7-methyl-4-oxo-1-phenylpyrimido[1,2-b]pyridazin-5-ium-2-olate 7-methyl-4-oxo-1-phenyl-3-(phenylmethyl)-2-pyrimido[1,2-b]pyridazin-5-iumolate SMR000224689 | cid_825048
Type:
Small organic molecule
Emp. Form.:
C21H17N3O2
Mol. Mass.:
343.3786
SMILES:
Cc1ccc2n(-c3ccccc3)c(=O)c(Cc3ccccc3)c([O-])[n+]2n1
: