Target
Sentrin-specific protease 1
Ligand
BDBM94810
Substrate
IC50
3490±n/a nM
Citation
 PubChem, PC Dose response confirmation of small molecule inhibitors of the catalytic domain of the SUMO protease, SENP1 in a FRET assay PubChem Bioassay (2012)[AID] 
Target
Name:
Sentrin-specific protease 1
Synonyms:
SENP1 Sentrin-specific protease 1 (SENP1)
Type:
Protein
Mol. Mass.:
73500.42
Organism:
Homo sapiens (Human)
Description:
Q9P0U3
Residue:
644
  
Inhibitor
Name:
BDBM94810
Synonyms:
6-chloranyl-2-oxidanylidene-N-(1,3-thiazol-2-yl)chromene-3-carboxamide 6-chloro-2-oxo-N-(1,3-thiazol-2-yl)chromene-3-carboxamide MLS000765012 cid_780578
Type:
Small organic molecule
Emp. Form.:
C13H7ClN2O3S
Mol. Mass.:
306.724
SMILES:
Clc1ccc2oc(=O)c(cc2c1)C(=O)Nc1nccs1
: