Target
Sentrin-specific protease 1
Ligand
BDBM94812
Substrate
IC50
20000±n/a nM
Citation
 PubChem, PC Dose response confirmation of small molecule inhibitors of the catalytic domain of the SUMO protease, SENP1 in a FRET assay PubChem Bioassay (2012)[AID] 
Target
Name:
Sentrin-specific protease 1
Synonyms:
SENP1 Sentrin-specific protease 1 (SENP1)
Type:
Protein
Mol. Mass.:
73500.42
Organism:
Homo sapiens (Human)
Description:
Q9P0U3
Residue:
644
  
Inhibitor
Name:
BDBM94812
Synonyms:
(E)-2-cyano-3-[2-(diethylamino)-7-methyl-3-quinolinyl]-2-propenamide (E)-2-cyano-3-[2-(diethylamino)-7-methyl-quinolin-3-yl]prop-2-enamide MLS001017651 cid_6176893
Type:
Small organic molecule
Emp. Form.:
C18H20N4O
Mol. Mass.:
308.3776
SMILES:
CCN(CC)c1nc2cc(C)ccc2cc1\C=C(/C#N)C(N)=O
: