Target
Sentrin-specific protease 1
Ligand
BDBM79737
Substrate
IC50
4650±n/a nM
Citation
 PubChem, PC Dose response confirmation of small molecule inhibitors of the catalytic domain of the SUMO protease, SENP1 in a FRET assay PubChem Bioassay (2012)[AID] 
Target
Name:
Sentrin-specific protease 1
Synonyms:
SENP1 Sentrin-specific protease 1 (SENP1)
Type:
Protein
Mol. Mass.:
73500.42
Organism:
Homo sapiens (Human)
Description:
Q9P0U3
Residue:
644
  
Inhibitor
Name:
BDBM79737
Synonyms:
Acetic acid 4-[4-(4-chloro-benzoyl)-1,3-dioxo-octahydro-pyrrolo[3,4-a]pyrrolizin-2-yl]-phenyl ester SMR000438074 [4-[4-(4-chlorophenyl)carbonyl-1,3-bis(oxidanylidene)-4,6,7,8,8a,8b-hexahydro-3aH-pyrrolo[3,4-a]pyrrolizin-2-yl]phenyl] ethanoate acetic acid [4-[4-[(4-chlorophenyl)-oxomethyl]-1,3-dioxo-4,6,7,8,8a,8b-hexahydro-3aH-pyrrolo[3,4-a]pyrrolizin-2-yl]phenyl] ester | cid_3552733
Type:
Small organic molecule
Emp. Form.:
C24H21ClN2O5
Mol. Mass.:
452.887
SMILES:
CC(=O)Oc1ccc(cc1)-n1c(O)c2C3CCCN3C(C(=O)c3ccc(Cl)cc3)c2c1O
: