Target
Sentrin-specific protease 1
Ligand
BDBM52785
Substrate
IC50
42400±n/a nM
Citation
 PubChem, PC Dose response confirmation of small molecule inhibitors of the catalytic domain of the SUMO protease, SENP1 in a FRET assay PubChem Bioassay (2012)[AID] 
Target
Name:
Sentrin-specific protease 1
Synonyms:
SENP1 Sentrin-specific protease 1 (SENP1)
Type:
Protein
Mol. Mass.:
73500.42
Organism:
Homo sapiens (Human)
Description:
Q9P0U3
Residue:
644
  
Inhibitor
Name:
BDBM52785
Synonyms:
2,2-Dimethyl-2,3-dihydro-1H,10H-phenothiazin-4-one MLS001029430 cid_390754
Type:
Small organic molecule
Emp. Form.:
C14H15NOS
Mol. Mass.:
245.34
SMILES:
CC1(C)CC(=O)C2Sc3ccccc3N=C2C1
: