Target
Sentrin-specific protease 1
Ligand
BDBM94822
Substrate
IC50
25400±n/a nM
Citation
 PubChem, PC Dose response confirmation of small molecule inhibitors of the catalytic domain of the SUMO protease, SENP1 in a FRET assay PubChem Bioassay (2012)[AID] 
Target
Name:
Sentrin-specific protease 1
Synonyms:
SENP1 Sentrin-specific protease 1 (SENP1)
Type:
Protein
Mol. Mass.:
73500.42
Organism:
Homo sapiens (Human)
Description:
Q9P0U3
Residue:
644
  
Inhibitor
Name:
BDBM94822
Synonyms:
2-(5-Cyano-4-trifluoromethyl-[2,4']bipyridinyl-6-ylsulfanyl)-N-(4-methyl-oxazol-2-yl)-acetamide 2-[3-cyano-6-pyridin-4-yl-4-(trifluoromethyl)pyridin-2-yl]sulfanyl-N-(4-methyl-1,3-oxazol-2-yl)ethanamide 2-[[3-cyano-6-pyridin-4-yl-4-(trifluoromethyl)-2-pyridinyl]thio]-N-(4-methyl-2-oxazolyl)acetamide SMR000014049 | cid_652747
Type:
Small organic molecule
Emp. Form.:
C18H12F3N5O2S
Mol. Mass.:
419.38
SMILES:
Cc1coc(NC(=O)CSc2nc(cc(c2C#N)C(F)(F)F)-c2ccncc2)n1
: