Target
Sentrin-specific protease 1
Ligand
BDBM94841
Substrate
IC50
20700±n/a nM
Citation
 PubChem, PC Dose response confirmation of small molecule inhibitors of the catalytic domain of the SUMO protease, SENP1 in a FRET assay PubChem Bioassay (2012)[AID] 
Target
Name:
Sentrin-specific protease 1
Synonyms:
SENP1 Sentrin-specific protease 1 (SENP1)
Type:
Protein
Mol. Mass.:
73500.42
Organism:
Homo sapiens (Human)
Description:
Q9P0U3
Residue:
644
  
Inhibitor
Name:
BDBM94841
Synonyms:
MLS002165579 N,N-dimethyl-2-(5-pyrrolidin-1-ylsulfonylpyridin-2-yl)sulfanylacetamide N,N-dimethyl-2-[[5-(1-pyrrolidinylsulfonyl)-2-pyridinyl]thio]acetamide cid_9533791
Type:
Small organic molecule
Emp. Form.:
C13H19N3O3S2
Mol. Mass.:
329.438
SMILES:
CN(C)C(=O)CSc1ccc(cn1)S(=O)(=O)N1CCCC1
: