Target
Sentrin-specific protease 1
Ligand
BDBM94872
Substrate
IC50
1930±n/a nM
Citation
 PubChem, PC Dose response confirmation of small molecule inhibitors of the catalytic domain of the SUMO protease, SENP1 in a FRET assay PubChem Bioassay (2012)[AID] 
Target
Name:
Sentrin-specific protease 1
Synonyms:
SENP1 Sentrin-specific protease 1 (SENP1)
Type:
Protein
Mol. Mass.:
73500.42
Organism:
Homo sapiens (Human)
Description:
Q9P0U3
Residue:
644
  
Inhibitor
Name:
BDBM94872
Synonyms:
(2E)-2-[1-(2,6-dimethylphenyl)-2H-1,2,3,4-tetrazol-5-ylidene]benzo[g]quinoxalin-3-one (2E)-2-[1-(2,6-dimethylphenyl)-2H-tetrazol-5-ylidene]benzo[g]quinoxalin-3-one SMR002134470 | cid_53299664
Type:
Small organic molecule
Emp. Form.:
C21H16N6O
Mol. Mass.:
368.3913
SMILES:
Cc1cccc(C)c1-n1nnnc1-c1nc2cc3ccccc3cc2[nH]c1=O
: