Target
Sentrin-specific protease 1
Ligand
BDBM94771
Substrate
IC50
13100±n/a nM
Citation
 PubChem, PC Dose response confirmation of small molecule inhibitors of the catalytic domain of the SUMO protease, SENP1 in a kinetic FRET assay PubChem Bioassay (2012)[AID] 
Target
Name:
Sentrin-specific protease 1
Synonyms:
SENP1 Sentrin-specific protease 1 (SENP1)
Type:
Protein
Mol. Mass.:
73500.42
Organism:
Homo sapiens (Human)
Description:
Q9P0U3
Residue:
644
  
Inhibitor
Name:
BDBM94771
Synonyms:
4-(5-Amino-1,3-dioxo-1,3-dihydro-isoindol-2-yl)-butyric acid 4-(5-amino-1,3-dioxo-2-isoindolyl)butanoic acid 4-[5-azanyl-1,3-bis(oxidanylidene)isoindol-2-yl]butanoic acid SMR000012333 | cid_652179
Type:
Small organic molecule
Emp. Form.:
C12H12N2O4
Mol. Mass.:
248.2347
SMILES:
Nc1ccc2C(=O)N(CCCC(O)=O)C(=O)c2c1
: