Target
Sentrin-specific protease 1
Ligand
BDBM94782
Substrate
IC50
19100±n/a nM
Citation
 PubChem, PC Dose response confirmation of small molecule inhibitors of the catalytic domain of the SUMO protease, SENP1 in a kinetic FRET assay PubChem Bioassay (2012)[AID] 
Target
Name:
Sentrin-specific protease 1
Synonyms:
SENP1 Sentrin-specific protease 1 (SENP1)
Type:
Protein
Mol. Mass.:
73500.42
Organism:
Homo sapiens (Human)
Description:
Q9P0U3
Residue:
644
  
Inhibitor
Name:
BDBM94782
Synonyms:
5-chloranyl-2-ethylsulfanyl-N-[3-(pyridin-3-ylmethylcarbamoyl)-4,5,6,7-tetrahydro-1-benzothiophen-2-yl]pyrimidine-4-carboxamide 5-chloro-2-(ethylthio)-N-[3-(3-pyridylmethylcarbamoyl)-4,5,6,7-tetrahydrobenzothiophen-2-yl]pyrimidine-4-carboxamide 5-chloro-2-ethylsulfanyl-N-[3-(pyridin-3-ylmethylcarbamoyl)-4,5,6,7-tetrahydro-1-benzothiophen-2-yl]pyrimidine-4-carboxamide SMR000201531 | cid_2237491
Type:
Small organic molecule
Emp. Form.:
C22H22ClN5O2S2
Mol. Mass.:
488.025
SMILES:
CCSc1ncc(Cl)c(n1)C(=O)Nc1sc2CCCCc2c1C(=O)NCc1cccnc1
: