Target
Sentrin-specific protease 1
Ligand
BDBM51029
Substrate
IC50
12800±n/a nM
Citation
 PubChem, PC Dose response confirmation of small molecule inhibitors of the catalytic domain of the SUMO protease, SENP1 in a kinetic FRET assay PubChem Bioassay (2012)[AID] 
Target
Name:
Sentrin-specific protease 1
Synonyms:
SENP1 Sentrin-specific protease 1 (SENP1)
Type:
Protein
Mol. Mass.:
73500.42
Organism:
Homo sapiens (Human)
Description:
Q9P0U3
Residue:
644
  
Inhibitor
Name:
BDBM51029
Synonyms:
6-(4-Ethoxy-3-methoxy-benzyl)-9-methoxy-6H-indolo[2,3-b]quinoxaline 6-[(4-ethoxy-3-methoxy-phenyl)methyl]-9-methoxy-indolo[3,2-b]quinoxaline MLS000331086 cid_1858122
Type:
Small organic molecule
Emp. Form.:
C25H23N3O3
Mol. Mass.:
413.4684
SMILES:
CCOc1ccc(Cn2c3ccc(OC)cc3c3nc4ccccc4nc23)cc1OC
: