Target
Sentrin-specific protease 1
Ligand
BDBM83603
Substrate
IC50
25600±n/a nM
Citation
 PubChem, PC Dose response confirmation of small molecule inhibitors of the catalytic domain of the SUMO protease, SENP1 in a kinetic FRET assay PubChem Bioassay (2012)[AID] 
Target
Name:
Sentrin-specific protease 1
Synonyms:
SENP1 Sentrin-specific protease 1 (SENP1)
Type:
Protein
Mol. Mass.:
73500.42
Organism:
Homo sapiens (Human)
Description:
Q9P0U3
Residue:
644
  
Inhibitor
Name:
BDBM83603
Synonyms:
MLS000677350 N-quinoxalin-5-ylquinoxalin-5-amine cid_2913620 | di(quinoxalin-5-yl)amine
Type:
Small organic molecule
Emp. Form.:
C16H11N5
Mol. Mass.:
273.292
SMILES:
N(c1cccc2nccnc12)c1cccc2nccnc12
: