Target
Sentrin-specific protease 1
Ligand
BDBM75821
Substrate
IC50
20400±n/a nM
Citation
 PubChem, PC Dose response confirmation of small molecule inhibitors of the catalytic domain of the SUMO protease, SENP1 in a kinetic FRET assay PubChem Bioassay (2012)[AID] 
Target
Name:
Sentrin-specific protease 1
Synonyms:
SENP1 Sentrin-specific protease 1 (SENP1)
Type:
Protein
Mol. Mass.:
73500.42
Organism:
Homo sapiens (Human)
Description:
Q9P0U3
Residue:
644
  
Inhibitor
Name:
BDBM75821
Synonyms:
2-[3-[1,2-dioxo-2-(4-phenyl-3,6-dihydro-2H-pyridin-1-yl)ethyl]-1-indolyl]-N,N-diethylacetamide N,N-diethyl-2-[3-[2-keto-2-(4-phenyl-3,6-dihydro-2H-pyridin-1-yl)acetyl]indol-1-yl]acetamide N,N-diethyl-2-[3-[2-oxo-2-(4-phenyl-3,6-dihydro-2H-pyridin-1-yl)acetyl]indol-1-yl]acetamide cid_16194649
Type:
Small organic molecule
Emp. Form.:
C27H29N3O3
Mol. Mass.:
443.5375
SMILES:
CCN(CC)C(=O)Cn1cc(C(=O)C(=O)N2CCC(=CC2)c2ccccc2)c2ccccc12
: