Target
Sentrin-specific protease 1
Ligand
BDBM94813
Substrate
IC50
26600±n/a nM
Citation
 PubChem, PC Dose response confirmation of small molecule inhibitors of the catalytic domain of the SUMO protease, SENP1 in a kinetic FRET assay PubChem Bioassay (2012)[AID] 
Target
Name:
Sentrin-specific protease 1
Synonyms:
SENP1 Sentrin-specific protease 1 (SENP1)
Type:
Protein
Mol. Mass.:
73500.42
Organism:
Homo sapiens (Human)
Description:
Q9P0U3
Residue:
644
  
Inhibitor
Name:
BDBM94813
Synonyms:
1-[2-[2-(morpholin-4-ylmethyl)-5-thiophen-2-yl-thieno[2,3-d]pyrimidin-4-yl]oxyphenyl]ethanone 1-[2-[2-(morpholinomethyl)-5-(2-thienyl)thieno[2,3-d]pyrimidin-4-yl]oxyphenyl]ethanone MLS000879967 cid_2540653
Type:
Small organic molecule
Emp. Form.:
C23H21N3O3S2
Mol. Mass.:
451.561
SMILES:
CC(=O)c1ccccc1Oc1nc(CN2CCOCC2)nc2scc(-c3cccs3)c12
: