Target
Sentrin-specific protease 1
Ligand
BDBM59680
Substrate
IC50
51100±n/a nM
Citation
 PubChem, PC Dose response confirmation of small molecule inhibitors of the catalytic domain of the SUMO protease, SENP1 in a kinetic FRET assay PubChem Bioassay (2012)[AID] 
Target
Name:
Sentrin-specific protease 1
Synonyms:
SENP1 Sentrin-specific protease 1 (SENP1)
Type:
Protein
Mol. Mass.:
73500.42
Organism:
Homo sapiens (Human)
Description:
Q9P0U3
Residue:
644
  
Inhibitor
Name:
BDBM59680
Synonyms:
5-keto-8-(piperidine-1-carbonyl)-N-(tetrahydrofurfuryl)-1-thioxo-4H-thiazolo[3,4-a]quinazoline-3-carboxamide 5-oxo-8-(piperidin-1-ylcarbonyl)-N-(tetrahydrofuran-2-ylmethyl)-1-thioxo-4,5-dihydro[1,3]thiazolo[3,4-a]quinazoline-3-carboxamide 5-oxo-N-(oxolan-2-ylmethyl)-8-(piperidine-1-carbonyl)-1-sulfanylidene-4H-[1,3]thiazolo[3,4-a]quinazoline-3-carboxamide SMR000030296 | cid_3243646
Type:
Small organic molecule
Emp. Form.:
C22H24N4O4S2
Mol. Mass.:
472.58
SMILES:
O=C(NCC1CCCO1)c1sc(=S)n2c1[nH]c(=O)c1ccc(cc21)C(=O)N1CCCCC1
: