Target
Sentrin-specific protease 1
Ligand
BDBM94820
Substrate
IC50
6200±n/a nM
Citation
 PubChem, PC Dose response confirmation of small molecule inhibitors of the catalytic domain of the SUMO protease, SENP1 in a kinetic FRET assay PubChem Bioassay (2012)[AID] 
Target
Name:
Sentrin-specific protease 1
Synonyms:
SENP1 Sentrin-specific protease 1 (SENP1)
Type:
Protein
Mol. Mass.:
73500.42
Organism:
Homo sapiens (Human)
Description:
Q9P0U3
Residue:
644
  
Inhibitor
Name:
BDBM94820
Synonyms:
(5Z)-5-[(2-hydroxy-1-naphthalenyl)methylidene]imidazolidine-2,4-dione (5Z)-5-[(2-hydroxynaphthalen-1-yl)methylidene]imidazolidine-2,4-dione MLS000756644 cid_6264712
Type:
Small organic molecule
Emp. Form.:
C14H10N2O3
Mol. Mass.:
254.2408
SMILES:
Oc1ccc2ccccc2c1\C=C1/NC(=O)NC1=O
: