Target
Sentrin-specific protease 1
Ligand
BDBM61444
Substrate
IC50
11000±n/a nM
Citation
 PubChem, PC Dose response confirmation of small molecule inhibitors of the catalytic domain of the SUMO protease, SENP1 in a kinetic FRET assay PubChem Bioassay (2012)[AID] 
Target
Name:
Sentrin-specific protease 1
Synonyms:
SENP1 Sentrin-specific protease 1 (SENP1)
Type:
Protein
Mol. Mass.:
73500.42
Organism:
Homo sapiens (Human)
Description:
Q9P0U3
Residue:
644
  
Inhibitor
Name:
BDBM61444
Synonyms:
4-(3-benzyl-4-keto-thiazolidin-2-yl)-N-[2-(benzylthio)ethyl]benzamide 4-[4-oxidanylidene-3-(phenylmethyl)-1,3-thiazolidin-2-yl]-N-[2-(phenylmethylsulfanyl)ethyl]benzamide MLS000519086 cid_6615272
Type:
Small organic molecule
Emp. Form.:
C26H26N2O2S2
Mol. Mass.:
462.627
SMILES:
O=C(NCCSCc1ccccc1)c1ccc(cc1)C1SCC(=O)N1Cc1ccccc1
: