Target
Sentrin-specific protease 1
Ligand
BDBM94852
Substrate
IC50
73800±n/a nM
Citation
 PubChem, PC Dose response confirmation of small molecule inhibitors of the catalytic domain of the SUMO protease, SENP1 in a kinetic FRET assay PubChem Bioassay (2012)[AID] 
Target
Name:
Sentrin-specific protease 1
Synonyms:
SENP1 Sentrin-specific protease 1 (SENP1)
Type:
Protein
Mol. Mass.:
73500.42
Organism:
Homo sapiens (Human)
Description:
Q9P0U3
Residue:
644
  
Inhibitor
Name:
BDBM94852
Synonyms:
MLS002588239 cid_9551378
Type:
Small organic molecule
Emp. Form.:
C22H23N3O2S3
Mol. Mass.:
457.632
SMILES:
CCCN(CCC)C(=O)Cn1c2c(sc(=S)n2c2ccsc2c1=O)-c1ccccc1
: