Target
Sentrin-specific protease 1
Ligand
BDBM94869
Substrate
IC50
4940±n/a nM
Citation
 PubChem, PC Dose response confirmation of small molecule inhibitors of the catalytic domain of the SUMO protease, SENP1 in a kinetic FRET assay PubChem Bioassay (2012)[AID] 
Target
Name:
Sentrin-specific protease 1
Synonyms:
SENP1 Sentrin-specific protease 1 (SENP1)
Type:
Protein
Mol. Mass.:
73500.42
Organism:
Homo sapiens (Human)
Description:
Q9P0U3
Residue:
644
  
Inhibitor
Name:
BDBM94869
Synonyms:
(2Z)-2-(1-amyl-2H-tetrazol-5-ylidene)benzo[g]quinoxalin-3-one (2Z)-2-(1-pentyl-2H-tetrazol-5-ylidene)-3-benzo[g]quinoxalinone MLS003468542 cid_53299661
Type:
Small organic molecule
Emp. Form.:
C18H18N6O
Mol. Mass.:
334.3751
SMILES:
CCCCCn1nnnc1-c1nc2cc3ccccc3cc2[nH]c1=O
: