Target
Low molecular weight phosphotyrosine protein phosphatase
Ligand
BDBM94887
Substrate
IC50
1820±n/a nM
Citation
 PubChem, PC Dose response confirmation of small molecule inhibitors of Low Molecular Weight Protein Tyrosine Phosphatase, LMPTP, via a fluorescence intensity assay PubChem Bioassay (2012)[AID] 
Target
Name:
Low molecular weight phosphotyrosine protein phosphatase
Synonyms:
3.1.3.2 ACP1 LMW-PTP LMWPTP PPAC_HUMAN low molecular weight phosphotyrosine protein phosphatase isoform c
Type:
Mol. Mass.:
18042.81
Organism:
Homo sapiens (Human)
Description:
P24666
Residue:
158
  
Inhibitor
Name:
BDBM94887
Synonyms:
1,3-benzodioxole-5-carboxylic acid [4-[(E)-[[(5-bromo-3-pyridinyl)-oxomethyl]hydrazinylidene]methyl]phenyl] ester MLS000573024 [4-[(E)-[(5-bromanylpyridin-3-yl)carbonylhydrazinylidene]methyl]phenyl] 1,3-benzodioxole-5-carboxylate cid_6898925 | piperonylic acid [4-[(E)-[(5-bromonicotinoyl)hydrazono]methyl]phenyl] ester
Type:
Small organic molecule
Emp. Form.:
C21H14BrN3O5
Mol. Mass.:
468.257
SMILES:
Brc1cncc(c1)C(=O)N\N=C\c1ccc(OC(=O)c2ccc3OCOc3c2)cc1
: