Target
Low molecular weight phosphotyrosine protein phosphatase
Ligand
BDBM95000
Substrate
IC50
5480±n/a nM
Citation
 PubChem, PC Dose response confirmation of small molecule inhibitors of Low Molecular Weight Protein Tyrosine Phosphatase, LMPTP, via a fluorescence intensity assay PubChem Bioassay (2012)[AID] 
Target
Name:
Low molecular weight phosphotyrosine protein phosphatase
Synonyms:
3.1.3.2 ACP1 LMW-PTP LMWPTP PPAC_HUMAN low molecular weight phosphotyrosine protein phosphatase isoform c
Type:
Mol. Mass.:
18042.81
Organism:
Homo sapiens (Human)
Description:
P24666
Residue:
158
  
Inhibitor
Name:
BDBM95000
Synonyms:
2-(2-fluorophenyl)-N-(1-phenylethyl)-4-quinazolinamine MLS001197038 [2-(2-fluorophenyl)quinazolin-4-yl]-(1-phenylethyl)amine | cid_15992808
Type:
Small organic molecule
Emp. Form.:
C22H18FN3
Mol. Mass.:
343.3968
SMILES:
CC(Nc1nc(nc2ccccc12)-c1ccccc1F)c1ccccc1
: