Target
Probable nicotinate-nucleotide adenylyltransferase
Ligand
BDBM95127
Substrate
IC50
15700±n/a nM
Citation
 PubChem, PC Dose response confirmation of uHTS inhibitor hits from NadD in a Colorimetric assay - Set 2 PubChem Bioassay (2012)[AID] 
Target
Name:
Probable nicotinate-nucleotide adenylyltransferase
Synonyms:
NADD_STAAN nadD
Type:
Enzyme Catalytic Domain
Mol. Mass.:
22100.53
Organism:
Staphylococcus aureus subsp. aureus N315
Description:
gi_15927174
Residue:
189
  
Inhibitor
Name:
BDBM95127
Synonyms:
5-(2,5-dichlorobenzyl)-4-methyl-4-thiazoline-2-thione 5-[(2,5-dichlorophenyl)methyl]-4-methyl-3H-thiazole-2-thione MLS000334618 cid_2554667
Type:
Small organic molecule
Emp. Form.:
C11H9Cl2NS2
Mol. Mass.:
290.232
SMILES:
Cc1nc(S)sc1Cc1cc(Cl)ccc1Cl
: