Target
Probable nicotinate-nucleotide adenylyltransferase
Ligand
BDBM50280
Substrate
IC50
18400±n/a nM
Citation
 PubChem, PC Dose response confirmation of uHTS inhibitor hits from NadD in a Colorimetric assay - Set 2 PubChem Bioassay (2012)[AID] 
Target
Name:
Probable nicotinate-nucleotide adenylyltransferase
Synonyms:
NADD_STAAN nadD
Type:
Enzyme Catalytic Domain
Mol. Mass.:
22100.53
Organism:
Staphylococcus aureus subsp. aureus N315
Description:
gi_15927174
Residue:
189
  
Inhibitor
Name:
BDBM50280
Synonyms:
2-(2-furanyl)-N-(4-methyl-2-thiazolyl)-4-quinolinecarboxamide 2-(furan-2-yl)-N-(4-methyl-1,3-thiazol-2-yl)quinoline-4-carboxamide SMR000260618 | cid_2366866
Type:
Small organic molecule
Emp. Form.:
C18H13N3O2S
Mol. Mass.:
335.38
SMILES:
Cc1csc(NC(=O)c2cc(nc3ccccc23)-c2ccco2)n1
: