Target
Probable nicotinate-nucleotide adenylyltransferase
Ligand
BDBM76088
Substrate
IC50
17300±n/a nM
Citation
 PubChem, PC Dose response confirmation of uHTS inhibitor hits from NadD in a Colorimetric assay - Set 2 PubChem Bioassay (2012)[AID] 
Target
Name:
Probable nicotinate-nucleotide adenylyltransferase
Synonyms:
NADD_STAAN nadD
Type:
Enzyme Catalytic Domain
Mol. Mass.:
22100.53
Organism:
Staphylococcus aureus subsp. aureus N315
Description:
gi_15927174
Residue:
189
  
Inhibitor
Name:
BDBM76088
Synonyms:
MLS-0295640.0001 N-[4-[(3,4-dimethyl-5-isoxazolyl)sulfamoyl]phenyl]-2-(4-methoxyphenyl)-4-quinolinecarboxamide cid_2333197
Type:
Small organic molecule
Emp. Form.:
C28H24N4O5S
Mol. Mass.:
528.579
SMILES:
COc1ccc(cc1)-c1cc(C(=O)Nc2ccc(cc2)S(=O)(=O)Nc2onc(C)c2C)c2ccccc2n1
: