Target
Probable nicotinate-nucleotide adenylyltransferase
Ligand
BDBM31355
Substrate
IC50
45400±n/a nM
Citation
 PubChem, PC Dose response confirmation of uHTS inhibitor hits from NadD in a Colorimetric assay - Set 2 PubChem Bioassay (2012)[AID] 
Target
Name:
Probable nicotinate-nucleotide adenylyltransferase
Synonyms:
NADD_STAAN nadD
Type:
Enzyme Catalytic Domain
Mol. Mass.:
22100.53
Organism:
Staphylococcus aureus subsp. aureus N315
Description:
gi_15927174
Residue:
189
  
Inhibitor
Name:
BDBM31355
Synonyms:
2,2-Di-m-tolyl-cyclopropanecarboxylic acid (2-hydroxy-4-nitro-phenyl)-amide MLS000554437 N-(2-hydroxy-4-nitrophenyl)-2,2-bis(3-methylphenyl)-1-cyclopropanecarboxamide SMR000171420 | cid_3105194
Type:
Small organic molecule
Emp. Form.:
C24H22N2O4
Mol. Mass.:
402.4425
SMILES:
Cc1cccc(c1)C1(CC1C(=O)Nc1ccc(cc1O)[N+]([O-])=O)c1cccc(C)c1
: