Target
Hepatocyte nuclear factor 4-alpha
Ligand
BDBM94575
Substrate
IC50
2775±n/a nM
Citation
 PubChem, PC Counterscreen for inhibitors of the interaction of the lipase co-activator protein, abhydrolase domain containing 5 (ABHD5) with perilipin-5 (MLDP; PLIN5): Luminescence-based biochemical high throughput dose response assay to identify inhibitors of Hepatocyte nuclear factor 4 (HNF4) dimerization PubChem Bioassay (2012)[AID] 
Target
Name:
Hepatocyte nuclear factor 4-alpha
Synonyms:
HNF4 HNF4A_HUMAN TCF14 | hepatocyte nuclear factor 4-alpha isoform b
Type:
PROTEIN
Mol. Mass.:
52790.24
Organism:
Homo sapiens (Human)
Description:
ChEMBL_606516
Residue:
474
  
Inhibitor
Name:
BDBM94575
Synonyms:
2-[3-(2-furanyl)-2-oxo-1-quinoxalinyl]-2-(1-naphthalenyl)-N-(phenylmethyl)acetamide MLS003674177 N-benzyl-2-[3-(furan-2-yl)-2-oxoquinoxalin-1-yl]-2-naphthalen-1-ylacetamide cid_53383158
Type:
Small organic molecule
Emp. Form.:
C31H23N3O3
Mol. Mass.:
485.5326
SMILES:
O=C(NCc1ccccc1)C(c1cccc2ccccc12)n1c2ccccc2nc(-c2ccco2)c1=O
: