Target
Perilipin-5
Ligand
BDBM94498
Substrate
IC50
9988±n/a nM
Citation
 PubChem, PC Luminescence-based biochemical high throughput dose response assay for inhibitors of the interaction of the lipase co-activator protein, abhydrolase domain containing 5 (ABHD5) with perilipin-5 (MLDP; PLIN5) produced in HEK293T cells PubChem Bioassay (2012)[AID] 
Target
Name:
Perilipin-5
Synonyms:
LSDP5 PAT-1 PLIN5_HUMAN
Type:
Enzyme Catalytic Domain
Mol. Mass.:
50774.20
Organism:
Homo sapiens (Human)
Description:
gi_116292172
Residue:
463
  
Inhibitor
Name:
BDBM94498
Synonyms:
2-cyclopropyl-2-[3-(2-furanyl)-2-oxo-1-quinoxalinyl]-N-pentylacetamide 2-cyclopropyl-2-[3-(furan-2-yl)-2-oxoquinoxalin-1-yl]-N-pentylacetamide N-amyl-2-cyclopropyl-2-[3-(2-furyl)-2-keto-quinoxalin-1-yl]acetamide cid_53383151
Type:
Small organic molecule
Emp. Form.:
C22H25N3O3
Mol. Mass.:
379.4522
SMILES:
CCCCCNC(=O)C(C1CC1)n1c2ccccc2nc(-c2ccco2)c1=O
: