Target
ADP-ribosylation factor GTPase-activating protein 1
Ligand
BDBM95195
Substrate
IC50
>164790±n/a nM
Citation
 PubChem, PC Fluorescence polarization-based biochemical high throughput dose response screening assay to identify inhibitors of ADP-ribosylation factor GTPase activating protein 1 (ARFGAP1) PubChem Bioassay (2012)[AID] 
Target
Name:
ADP-ribosylation factor GTPase-activating protein 1
Synonyms:
ARFG1_RAT Arfgap1
Type:
Enzyme Catalytic Domain
Mol. Mass.:
45436.38
Organism:
Rattus norvegicus
Description:
gi_21489979
Residue:
415
  
Inhibitor
Name:
BDBM95195
Synonyms:
3-hydroxy-2-naphthalenecarboxylic acid [2-(3,5-dimethyl-1-piperidinyl)-2-oxoethyl] ester MLS000055286 [2-(3,5-dimethylpiperidin-1-yl)-2-oxidanylidene-ethyl] 3-oxidanylnaphthalene-2-carboxylate cid_2999033
Type:
Small organic molecule
Emp. Form.:
C20H23NO4
Mol. Mass.:
341.4009
SMILES:
CC1CC(C)CN(C1)C(=O)COC(=O)c1cc2ccccc2cc1O
: