Target
ADP-ribosylation factor GTPase-activating protein 1
Ligand
BDBM95213
Substrate
IC50
46605±n/a nM
Citation
 PubChem, PC Fluorescence polarization-based biochemical high throughput dose response screening assay to identify inhibitors of ADP-ribosylation factor GTPase activating protein 1 (ARFGAP1) PubChem Bioassay (2012)[AID] 
Target
Name:
ADP-ribosylation factor GTPase-activating protein 1
Synonyms:
ARFG1_RAT Arfgap1
Type:
Enzyme Catalytic Domain
Mol. Mass.:
45436.38
Organism:
Rattus norvegicus
Description:
gi_21489979
Residue:
415
  
Inhibitor
Name:
BDBM95213
Synonyms:
3-(dimethylsulfamoyl)-N-[[4-[(5-methyl-1,2-oxazol-3-yl)sulfamoyl]phenyl]carbamothioyl]benzamide 3-(dimethylsulfamoyl)-N-[[4-[(5-methylisoxazol-3-yl)sulfamoyl]phenyl]thiocarbamoyl]benzamide SMR000364210 | cid_2379048
Type:
Small organic molecule
Emp. Form.:
C20H21N5O6S3
Mol. Mass.:
523.606
SMILES:
CN(C)S(=O)(=O)c1cccc(c1)C(=O)NC(=S)Nc1ccc(cc1)S(=O)(=O)Nc1cc(C)on1
: