Target
ADP-ribosylation factor GTPase-activating protein 1
Ligand
BDBM95221
Substrate
IC50
50713±n/a nM
Citation
 PubChem, PC Fluorescence polarization-based biochemical high throughput dose response screening assay to identify inhibitors of ADP-ribosylation factor GTPase activating protein 1 (ARFGAP1) PubChem Bioassay (2012)[AID] 
Target
Name:
ADP-ribosylation factor GTPase-activating protein 1
Synonyms:
ARFG1_RAT Arfgap1
Type:
Enzyme Catalytic Domain
Mol. Mass.:
45436.38
Organism:
Rattus norvegicus
Description:
gi_21489979
Residue:
415
  
Inhibitor
Name:
BDBM95221
Synonyms:
(5Z)-3-(4-chlorophenyl)-2,1-benzoxazole-5-carboxaldehyde oxime (NZ)-N-[[3-(4-chlorophenyl)-2,1-benzoxazol-5-yl]methylidene]hydroxylamine MLS001166493 cid_5524736
Type:
Small organic molecule
Emp. Form.:
C14H9ClN2O2
Mol. Mass.:
272.686
SMILES:
Clc1ccc(cc1)-c1onc2ccc(CN=O)cc12
: