Target
ADP-ribosylation factor GTPase-activating protein 1
Ligand
BDBM95242
Substrate
IC50
>18306±n/a nM
Citation
 PubChem, PC Fluorescence polarization-based biochemical high throughput dose response screening assay to identify inhibitors of ADP-ribosylation factor GTPase activating protein 1 (ARFGAP1) PubChem Bioassay (2012)[AID] 
Target
Name:
ADP-ribosylation factor GTPase-activating protein 1
Synonyms:
ARFG1_RAT Arfgap1
Type:
Enzyme Catalytic Domain
Mol. Mass.:
45436.38
Organism:
Rattus norvegicus
Description:
gi_21489979
Residue:
415
  
Inhibitor
Name:
BDBM95242
Synonyms:
MLS003123272 N-[2-(dimethylamino)ethyl]-4-[3-(4-phenoxyphenyl)imidazo[1,2-a]pyrazin-6-yl]benzamide US10688093, Compound BF000334031 cid_49786470
Type:
Small organic molecule
Emp. Form.:
C29H27N5O2
Mol. Mass.:
477.557
SMILES:
CN(C)CCNC(=O)c1ccc(cc1)-c1cn2c(cnc2cn1)-c1ccc(Oc2ccccc2)cc1
: