Target
Envelope glycoprotein gp160
Ligand
BDBM39599
Substrate
IC50
>67043±n/a nM
Citation
 PubChem, PC TRFRET-based biochemical high throughput dose response assay for small molecules that bind to the HIV-1-gp120 binding antibody, PG9 PubChem Bioassay (2012)[AID] 
Target
Name:
Envelope glycoprotein gp160
Synonyms:
ENV_HV1H2 Envelope surface glycoprotein gp160, precursor env
Type:
Mol. Mass.:
97241.93
Organism:
Human immunodeficiency virus type 1 group M subtype B (isolate HXB2)
Description:
Residue:
856
  
Inhibitor
Name:
BDBM39599
Synonyms:
MLS000056730 N-(4-methyl-2-oxidanylidene-chromen-7-yl)-2,3-dihydro-1,4-benzodioxine-3-carboxamide N-(4-methyl-2-oxochromen-7-yl)-2,3-dihydro-1,4-benzodioxine-3-carboxamide cid_2997570
Type:
Small organic molecule
Emp. Form.:
C19H15NO5
Mol. Mass.:
337.3261
SMILES:
Cc1cc(=O)oc2cc(NC(=O)C3COc4ccccc4O3)ccc12
: