Target
Envelope glycoprotein gp160
Ligand
BDBM95253
Substrate
IC50
>67047±n/a nM
Citation
 PubChem, PC TRFRET-based biochemical high throughput dose response assay for small molecules that bind to the HIV-1-gp120 binding antibody, PG9 PubChem Bioassay (2012)[AID] 
Target
Name:
Envelope glycoprotein gp160
Synonyms:
ENV_HV1H2 Envelope surface glycoprotein gp160, precursor env
Type:
Mol. Mass.:
97241.93
Organism:
Human immunodeficiency virus type 1 group M subtype B (isolate HXB2)
Description:
Residue:
856
  
Inhibitor
Name:
BDBM95253
Synonyms:
MLS000531638 N-(4-acetylphenyl)-2,5-dimethoxybenzenesulfonamide SMR000136616 | cid_768882
Type:
Small organic molecule
Emp. Form.:
C16H17NO5S
Mol. Mass.:
335.375
SMILES:
COc1ccc(OC)c(c1)S(=O)(=O)Nc1ccc(cc1)C(C)=O
: